Target
Genome polyprotein
Ligand
BDBM39393
Substrate
Meas. Tech.
West Nile Virus NS2bNS3 Proteinase Inhibitor Dose Response Confirmation.
IC50
>50000±n/a nM
Citation
 PubChem, PC West Nile Virus NS2bNS3 Proteinase Inhibitor Dose Response Confirmation. PubChem Bioassay (2007)[AID] 
Target
Name:
Genome polyprotein
Synonyms:
POLG_WNV | polyprotein precursor
Type:
PROTEIN
Mol. Mass.:
380170.63
Organism:
West Nile virus
Description:
ChEMBL_1438217
Residue:
3430
  
Inhibitor
Name:
BDBM39393
Synonyms:
MLS000096189 N-(4-fluorobenzyl)-1-isoamyl-5-keto-pyrrolidine-3-carboxamide N-[(4-fluorophenyl)methyl]-1-(3-methylbutyl)-5-oxo-3-pyrrolidinecarboxamide SMR000032137 | cid_3240092
Type:
Small organic molecule
Emp. Form.:
C17H23FN2O2
Mol. Mass.:
306.3751
SMILES:
CC(C)CCN1CC(CC1=O)C(=O)NCc1ccc(F)cc1
: