Target
Genome polyprotein
Ligand
BDBM32784
Substrate
Meas. Tech.
West Nile Virus NS2bNS3 Proteinase Inhibitor Dose Response Confirmation.
IC50
2376±n/a nM
Citation
 PubChem, PC West Nile Virus NS2bNS3 Proteinase Inhibitor Dose Response Confirmation. PubChem Bioassay (2007)[AID] 
Target
Name:
Genome polyprotein
Synonyms:
POLG_WNV | polyprotein precursor
Type:
PROTEIN
Mol. Mass.:
380170.63
Organism:
West Nile virus
Description:
ChEMBL_1438217
Residue:
3430
  
Inhibitor
Name:
BDBM32784
Synonyms:
2-thiophenecarboxylic acid [5-amino-1-(benzenesulfonyl)-3-pyrazolyl] ester CHEMBL389130 SMR000021562 [5-azanyl-1-(phenylsulfonyl)pyrazol-3-yl] thiophene-2-carboxylate thiophene-2-carboxylic acid (5-amino-1-besyl-pyrazol-3-yl) ester
Type:
Small organic molecule
Emp. Form.:
C14H11N3O4S2
Mol. Mass.:
349.385
SMILES:
Nc1cc(OC(=O)c2cccs2)nn1S(=O)(=O)c1ccccc1
: