Target
Genome polyprotein
Ligand
BDBM39398
Substrate
Meas. Tech.
West Nile Virus NS2bNS3 Proteinase Inhibitor Dose Response Confirmation.
IC50
>50000±n/a nM
Citation
 PubChem, PC West Nile Virus NS2bNS3 Proteinase Inhibitor Dose Response Confirmation. PubChem Bioassay (2007)[AID] 
Target
Name:
Genome polyprotein
Synonyms:
POLG_WNV | polyprotein precursor
Type:
PROTEIN
Mol. Mass.:
380170.63
Organism:
West Nile virus
Description:
ChEMBL_1438217
Residue:
3430
  
Inhibitor
Name:
BDBM39398
Synonyms:
2-[[1-oxo-3-phenyl-2-(thiophen-2-ylsulfonylamino)propyl]amino]acetic acid ethyl ester MLS000044651 cid_3243538 ethyl 2-[[3-phenyl-2-(thiophen-2-ylsulfonylamino)propanoyl]amino]ethanoate | ethyl N-(thien-2-ylsulfonyl)phenylalanylglycinate
Type:
Small organic molecule
Emp. Form.:
C17H20N2O5S2
Mol. Mass.:
396.481
SMILES:
CCOC(=O)CNC(=O)C(Cc1ccccc1)NS(=O)(=O)c1cccs1
: