Target
Genome polyprotein
Ligand
BDBM39399
Substrate
Meas. Tech.
West Nile Virus NS2bNS3 Proteinase Inhibitor Dose Response Confirmation.
IC50
>50000±n/a nM
Citation
 PubChem, PC West Nile Virus NS2bNS3 Proteinase Inhibitor Dose Response Confirmation. PubChem Bioassay (2007)[AID] 
Target
Name:
Genome polyprotein
Synonyms:
POLG_WNV | polyprotein precursor
Type:
PROTEIN
Mol. Mass.:
380170.63
Organism:
West Nile virus
Description:
ChEMBL_1438217
Residue:
3430
  
Inhibitor
Name:
BDBM39399
Synonyms:
5-[(2-methylphenyl)sulfonylmethyl]-N-(3-propan-2-yloxypropyl)-2-furancarboxamide MLS000095157 N-(3-isopropoxypropyl)-5-{[(2-methylphenyl)sulfonyl]methyl}-2-furamide cid_3243626
Type:
Small organic molecule
Emp. Form.:
C19H25NO5S
Mol. Mass.:
379.471
SMILES:
CC(C)OCCCNC(=O)c1ccc(CS(=O)(=O)c2ccccc2C)o1
: