Target
Genome polyprotein
Ligand
BDBM39400
Substrate
Meas. Tech.
West Nile Virus NS2bNS3 Proteinase Inhibitor Dose Response Confirmation.
IC50
>50000±n/a nM
Citation
 PubChem, PC West Nile Virus NS2bNS3 Proteinase Inhibitor Dose Response Confirmation. PubChem Bioassay (2007)[AID] 
Target
Name:
Genome polyprotein
Synonyms:
POLG_WNV | polyprotein precursor
Type:
PROTEIN
Mol. Mass.:
380170.63
Organism:
West Nile virus
Description:
ChEMBL_1438217
Residue:
3430
  
Inhibitor
Name:
BDBM39400
Synonyms:
2-(5-bromo-1-propionyl-indolin-7-yl)sulfonylacetic acid methyl ester MLS000047135 cid_3243651 methyl 2-[(5-bromo-1-propanoyl-2,3-dihydroindol-7-yl)sulfonyl]acetate | methyl [(5-bromo-1-propionyl-2,3-dihydro-1H-indol-7-yl)sulfonyl]acetate
Type:
Small organic molecule
Emp. Form.:
C14H16BrNO5S
Mol. Mass.:
390.25
SMILES:
CCC(=O)N1CCc2cc(Br)cc(c12)S(=O)(=O)CC(=O)OC
: