Target
Genome polyprotein
Ligand
BDBM39404
Substrate
Meas. Tech.
West Nile Virus NS2bNS3 Proteinase Inhibitor Dose Response Confirmation.
IC50
>50000±n/a nM
Citation
 PubChem, PC West Nile Virus NS2bNS3 Proteinase Inhibitor Dose Response Confirmation. PubChem Bioassay (2007)[AID] 
Target
Name:
Genome polyprotein
Synonyms:
POLG_WNV | polyprotein precursor
Type:
PROTEIN
Mol. Mass.:
380170.63
Organism:
West Nile virus
Description:
ChEMBL_1438217
Residue:
3430
  
Inhibitor
Name:
BDBM39404
Synonyms:
MLS000088265 N-(3-carbazol-9-yl-2-hydroxypropyl)-4-fluoro-N-(2-hydroxyethyl)benzenesulfonamide N-[3-(9-carbazolyl)-2-hydroxypropyl]-4-fluoro-N-(2-hydroxyethyl)benzenesulfonamide SMR000072508 | cid_2938841
Type:
Small organic molecule
Emp. Form.:
C23H23FN2O4S
Mol. Mass.:
442.503
SMILES:
OCCN(CC(O)Cn1c2ccccc2c2ccccc12)S(=O)(=O)c1ccc(F)cc1
: