Target
Genome polyprotein
Ligand
BDBM39406
Substrate
Meas. Tech.
West Nile Virus NS2bNS3 Proteinase Inhibitor Dose Response Confirmation.
IC50
>50000±n/a nM
Citation
 PubChem, PC West Nile Virus NS2bNS3 Proteinase Inhibitor Dose Response Confirmation. PubChem Bioassay (2007)[AID] 
Target
Name:
Genome polyprotein
Synonyms:
POLG_WNV | polyprotein precursor
Type:
PROTEIN
Mol. Mass.:
380170.63
Organism:
West Nile virus
Description:
ChEMBL_1438217
Residue:
3430
  
Inhibitor
Name:
BDBM39406
Synonyms:
MLS000063766 N-cyclohexyl-1-methyl-5-benzotriazolecarboxamide N-cyclohexyl-1-methylbenzotriazole-5-carboxamide cid_900740
Type:
Small organic molecule
Emp. Form.:
C14H18N4O
Mol. Mass.:
258.3189
SMILES:
Cn1nnc2cc(ccc12)C(=O)NC1CCCCC1
: