Target
Genome polyprotein
Ligand
BDBM39418
Substrate
Meas. Tech.
West Nile Virus NS2bNS3 Proteinase Inhibitor Dose Response Confirmation.
IC50
34090±n/a nM
Citation
 PubChem, PC West Nile Virus NS2bNS3 Proteinase Inhibitor Dose Response Confirmation. PubChem Bioassay (2007)[AID] 
Target
Name:
Genome polyprotein
Synonyms:
POLG_WNV | polyprotein precursor
Type:
PROTEIN
Mol. Mass.:
380170.63
Organism:
West Nile virus
Description:
ChEMBL_1438217
Residue:
3430
  
Inhibitor
Name:
BDBM39418
Synonyms:
2-(p-anisidinomethylene)cyclohexane-1,3-quinone 2-[[(4-methoxyphenyl)amino]methylidene]cyclohexane-1,3-dione SMR000104253 | cid_876336
Type:
Small organic molecule
Emp. Form.:
C14H15NO3
Mol. Mass.:
245.2738
SMILES:
[#6]-[#8]-c1ccc(-[#7]\[#6]=[#6]-2\[#6](=O)-[#6]-[#6]-[#6]-[#6]-2=O)cc1
: