Target
Steroidogenic factor 1
Ligand
BDBM39508
Substrate
Meas. Tech.
Dose-response cell-based assay for activators of the nuclear receptor Steroidogenic Factor 1 (SF-1)
EC50
1252±n/a nM
Citation
 PubChem, PC Dose-response cell-based assay for activators of the nuclear receptor Steroidogenic Factor 1 (SF-1) PubChem Bioassay (2007)[AID] 
Target
Name:
Steroidogenic factor 1
Synonyms:
AD4BP FTZF1 NR5A1 SF-1 STF-1 Steroid hormone receptor Ad4BP
Type:
Nuclear Hormone Receptor
Mol. Mass.:
51643.43
Organism:
Homo sapiens (Human)
Description:
Residue:
461
  
Inhibitor
Name:
BDBM39508
Synonyms:
2-(4-ethoxyphenyl)-3-hydroxy-3H-isoindol-1-one 3-hydroxy-2-p-phenetyl-isoindolin-1-one SMR000093903 | cid_5309890
Type:
Small organic molecule
Emp. Form.:
C16H15NO3
Mol. Mass.:
269.2952
SMILES:
CCOc1ccc(cc1)N1C(O)c2ccccc2C1=O
: