Target
N-formyl peptide receptor 2
Ligand
BDBM40430
Substrate
Meas. Tech.
Formylpeptide Receptor (FPR) Ligand Structure Activity Relationship (SAR) Analysis : Dose Response Assay Counterscreen Against Formyl Peptide Receptor-Like-1 (FPRL1)
Ki
>40300±n/a nM
Citation
 PubChem, PC Formylpeptide Receptor (FPR) Ligand Structure Activity Relationship (SAR) Analysis : Dose Response Assay Counterscreen Against Formyl Peptide Receptor-Like-1 (FPRL1)  PubChem Bioassay (2007)[AID] 
Target
Name:
N-formyl peptide receptor 2
Synonyms:
ALXR, FPRL1, FPR2 FPR2 FPRH1 Formyl Peptide Receptor-Like 1 LXA4 receptor Lipoxin A4 receptor RFP | hFPRL
Type:
G Protein-Coupled Receptor (GPCR)
Mol. Mass.:
38968.35
Organism:
Homo sapiens (Human)
Description:
P25090
Residue:
351
  
Inhibitor
Name:
BDBM40430
Synonyms:
3-(1-benzofuran-2-carbonyl)-4-hydroxy-1-(3-imidazol-1-ylpropyl)-2-pyridin-3-yl-2H-pyrrol-5-one 3-[2-benzofuranyl(oxo)methyl]-4-hydroxy-1-[3-(1-imidazolyl)propyl]-2-(3-pyridinyl)-2H-pyrrol-5-one UNM000003586101 | cid_3274349
Type:
Small organic molecule
Emp. Form.:
C24H20N4O4
Mol. Mass.:
428.44
SMILES:
O=C(C1C(N(CCCn2ccnc2)C(=O)C1=O)c1cccnc1)c1cc2ccccc2o1
: