Target
Beta-hexosaminidase subunit alpha
Ligand
BDBM40767
Substrate
Meas. Tech.
Inhibition Assay
Ki
10000±0.0 nM
Citation
 Liu, JShikhman, ARLotz, MKWong, CH Hexosaminidase inhibitors as new drug candidates for the therapy of osteoarthritis. Chem Biol 8:701-11 (2001)  
Target
Name:
Beta-hexosaminidase subunit alpha
Synonyms:
Beta-N-acetylhexosaminidase subunit alpha HEXA | HEXA_HUMAN
Type:
Protein
Mol. Mass.:
60688.46
Organism:
Homo sapiens (Human)
Description:
P06865
Residue:
529
  
Inhibitor
Name:
BDBM40767
Synonyms:
Iminocyclitol, 10
Type:
Small organic molecule
Emp. Form.:
C7H10NO7S2
Mol. Mass.:
284.287
SMILES:
CC1=NC2C(OC(OS([O-])(=O)=O)C(O)C2O)S1
: