Target
Complement C1s subcomponent
Ligand
BDBM40859
Substrate
Meas. Tech.
Complement factor C1s IC50 from mixture screen
IC50
>50000±0 nM
Citation
 PubChem, PC Complement factor C1s IC50 from mixture screen PubChem Bioassay (2008)[AID] 
Target
Name:
Complement C1s subcomponent
Synonyms:
C1 esterase C1S_HUMAN Complement C1s subcomponent Complement C1s subcomponent light chain Trypsin | complement component 1, s subcomponent
Type:
Protein
Mol. Mass.:
76657.91
Organism:
Homo sapiens (Human)
Description:
P09871
Residue:
688
  
Inhibitor
Name:
BDBM40859
Synonyms:
MLS000087928 N-(4-methoxy-6-methyl-pyrimidin-2-yl)-N-propyl-benzenesulfonamide SMR000024246 | cid_3245110
Type:
Small organic molecule
Emp. Form.:
C15H19N3O3S
Mol. Mass.:
321.395
SMILES:
CCCN(c1nc(C)cc(OC)n1)S(=O)(=O)c1ccccc1
: