Target
Procathepsin L
Ligand
BDBM35507
Substrate
Meas. Tech.
Cathepsin L dose-response confirmation
IC50
31154.9±13253.1 nM
Citation
 PubChem, PC Cathepsin L dose-response confirmation PubChem Bioassay (2008)[AID] 
Target
Name:
Procathepsin L
Synonyms:
CATL1_HUMAN CTSL CTSL1 Cathepsin L Cathepsin L1 heavy chain MEP cathepsin L preproprotein
Type:
Enzyme
Mol. Mass.:
37557.19
Organism:
Homo sapiens (Human)
Description:
Purchased from Calbiochem (San Diego, CA).
Residue:
333
  
Inhibitor
Name:
BDBM35507
Synonyms:
4-[1-(3-methoxybenzyl)-1H-benzimidazol-2-yl]-1,2,5-oxadiazol-3-amine 4-[1-[(3-methoxyphenyl)methyl]benzimidazol-2-yl]-1,2,5-oxadiazol-3-amine SMR000020688 cid_1506381
Type:
Small organic molecule
Emp. Form.:
C17H15N5O2
Mol. Mass.:
321.3333
SMILES:
COc1cccc(Cn2c(nc3ccccc23)-c2nonc2N)c1
: