Target
Cathepsin S
Ligand
BDBM34163
Substrate
Meas. Tech.
Cathepsin S dose-response confirmation
IC50
2143.4±88.4458 nM
Citation
 PubChem, PC Cathepsin S dose-response confirmation PubChem Bioassay (2008)[AID] 
Target
Name:
Cathepsin S
Synonyms:
CATS_HUMAN Cathepsin S (Cat S) | cathepsin S preproprotein
Type:
Protein
Mol. Mass.:
37507.38
Organism:
Homo sapiens (Human)
Description:
P25774
Residue:
331
  
Inhibitor
Name:
BDBM34163
Synonyms:
3-Amino-7-benzyl-1-thioxo-5,6,7,8-tetrahydro-1H-thiopyrano[3,4-c]pyridine-4-carbonitrile 3-amino-7-benzyl-1-sulfanylidene-6,8-dihydro-5H-thiopyrano[3,4-c]pyridine-4-carbonitrile 3-azanyl-7-(phenylmethyl)-1-sulfanylidene-6,8-dihydro-5H-thiopyrano[3,4-c]pyridine-4-carbonitrile SMR000011772 | cid_787437
Type:
Small organic molecule
Emp. Form.:
C16H15N3S2
Mol. Mass.:
313.44
SMILES:
Nc1sc(=S)c2CN(Cc3ccccc3)CCc2c1C#N
: