Target
Sphingosine 1-phosphate receptor 2
Ligand
BDBM38993
Substrate
Meas. Tech.
Dose Response Cell Based Assay for Antagonists of the S1P2 Receptor
IC50
4499±n/a nM
Citation
 PubChem, PC Dose Response Cell Based Assay for Antagonists of the S1P2 Receptor PubChem Bioassay (2007)[AID] 
Target
Name:
Sphingosine 1-phosphate receptor 2
Synonyms:
EDG5 S1PR2 Sphingosine 1-phosphate receptor Sphingosine-1-phosphate receptor 2 | ndothelial differentiation G-protein coupled receptor 5
Type:
G Protein-Coupled Receptor (GPCR)
Mol. Mass.:
38883.16
Organism:
Homo sapiens (Human)
Description:
Membranes isolated from S1P2-transfected CHO cells were used in ligand binding assay.
Residue:
353
  
Inhibitor
Name:
BDBM38993
Synonyms:
(1Z,3Z)-1,4-bis(butylsulfonyl)buta-1,3-diene SMR000020833 | cid_5286934
Type:
Small organic molecule
Emp. Form.:
C12H22O4S2
Mol. Mass.:
294.431
SMILES:
CCCCS(=O)(=O)\C=C/C=C\S(=O)(=O)CCCC
: