Target
Serine/threonine-protein kinase PLK1
Ligand
BDBM41834
Substrate
Meas. Tech.
Concentration Response fluorescence polarization-based assay to confirm small molecule inhibitors identified in the Polo box domain (PBD) of Plk1 Primary HTS.
IC50
>50000±n/a nM
Citation
 PubChem, PC Concentration Response fluorescence polarization-based assay to confirm small molecule inhibitors identified in the Polo box domain (PBD) of Plk1 Primary HTS. PubChem Bioassay (2007)[AID] 
Target
Name:
Serine/threonine-protein kinase PLK1
Synonyms:
PLK PLK1 Polo-like kinase 1 (PlK1) STPK13 Serine/threonine-protein kinase 13 | polo-like kinase
Type:
Serine/threonine-protein kinase
Mol. Mass.:
68277.16
Organism:
Homo sapiens (Human)
Description:
P53350
Residue:
603
  
Inhibitor
Name:
BDBM41834
Synonyms:
MLS000551587 N-[3-[4-(2-ethoxyphenyl)-1-piperazinyl]-1,4-dioxo-2-naphthalenyl]-2-thiophenesulfonamide N-[3-[4-(2-ethoxyphenyl)piperazin-1-yl]-1,4-dioxonaphthalen-2-yl]thiophene-2-sulfonamide Thiophene-2-sulfonic acid {3-[4-(2-ethoxy-phenyl)-piperazin-1-yl]-1,4-dioxo-1,4-dihydro-naphthalen-2-yl}-amide | cid_1423408
Type:
Small organic molecule
Emp. Form.:
C26H25N3O5S2
Mol. Mass.:
523.624
SMILES:
CCOc1ccccc1N1CCN(CC1)C1=C(NS(=O)(=O)c2cccs2)C(=O)c2ccccc2C1=O
: