Target
Dual specificity protein phosphatase 6
Ligand
BDBM31735
Substrate
Meas. Tech.
MKP-3 in vitro secondary assay for identification of irreversible and slow-binding inhibitors
IC50
4400±200 nM
Citation
 PubChem, PC MKP-3 in vitro secondary assay for identification of irreversible and slow-binding inhibitors PubChem Bioassay (2008)[AID] 
Target
Name:
Dual specificity protein phosphatase 6
Synonyms:
DUS6_RAT MAP kinase phosphatase 3 Mitogen-activated protein kinase phosphatase 3 | Mkp3
Type:
Enzyme
Mol. Mass.:
42303.19
Organism:
Rattus norvegicus
Description:
gi_16758752
Residue:
381
  
Inhibitor
Name:
BDBM31735
Synonyms:
(7Z)-3-bromanyl-7-(furan-2-ylmethylidene)-[1,3]thiazolo[4,5]imidazo[1,2-b]pyridin-8-one (7Z)-3-bromo-7-(2-furfurylidene)thiazolo[4,5]imidazo[1,2-b]pyridin-8-one MLS-0091940.0001 | cid_6456506
Type:
Small organic molecule
Emp. Form.:
C13H6BrN3O2S
Mol. Mass.:
348.175
SMILES:
Brc1cnc2c(c1)nc1s\c(=C/c3ccco3)c(=O)n21
: