Target
Neuropeptide Y receptor type 1
Ligand
BDBM42449
Substrate
Meas. Tech.
Dose response cell-based screening assay for antagonists of neuropeptide Y receptor Y1 (NPY-Y1)
IC50
3391±n/a nM
Citation
 PubChem, PC Dose response cell-based screening assay for antagonists of neuropeptide Y receptor Y1 (NPY-Y1) PubChem Bioassay (2008)[AID] 
Target
Name:
Neuropeptide Y receptor type 1
Synonyms:
NPY-Y1 NPY1R NPYR neuropeptide Y receptor Y1
Type:
Enzyme Catalytic Domain
Mol. Mass.:
44399.07
Organism:
Homo sapiens (Human)
Description:
NPY-Y1 NPY1R HUMAN::P25929
Residue:
384
  
Inhibitor
Name:
BDBM42449
Synonyms:
3-fluoranyl-N-[2-[(3,6,7-trimethylquinolin-2-yl)amino]ethyl]benzamide 3-fluoro-N-[2-[(3,6,7-trimethyl-2-quinolyl)amino]ethyl]benzamide MLS000688426 cid_3206677
Type:
Small organic molecule
Emp. Form.:
C21H22FN3O
Mol. Mass.:
351.4173
SMILES:
Cc1cc2cc(C)c(NCCNC(=O)c3cccc(F)c3)nc2cc1C
: