Target
Neuropeptide Y receptor type 1
Ligand
BDBM42573
Substrate
Meas. Tech.
Dose response counterscreen for neuropeptide Y receptor Y2 (NPY-Y2): Cell-based high throughput assay to measure NPY-Y1 antagonism
IC50
13610±n/a nM
Citation
 PubChem, PC Dose response counterscreen for neuropeptide Y receptor Y2 (NPY-Y2): Cell-based high throughput assay to measure NPY-Y1 antagonism PubChem Bioassay (2008)[AID] 
Target
Name:
Neuropeptide Y receptor type 1
Synonyms:
NPY-Y1 NPY1R NPYR neuropeptide Y receptor Y1
Type:
Enzyme Catalytic Domain
Mol. Mass.:
44399.07
Organism:
Homo sapiens (Human)
Description:
NPY-Y1 NPY1R HUMAN::P25929
Residue:
384
  
Inhibitor
Name:
BDBM42573
Synonyms:
1-methyl-4-(2-phenylsulfanylphenoxy)piperidine;oxalic acid 1-methyl-4-piperidinyl 2-(phenylsulfanyl)phenyl ether SMR000224973 ethanedioic acid;1-methyl-4-(2-phenylsulfanylphenoxy)piperidine
Type:
Small organic molecule
Emp. Form.:
C18H21NOS
Mol. Mass.:
299.43
SMILES:
CN1CCC(CC1)Oc1ccccc1Sc1ccccc1
: