Target
Nuclear receptor coactivator 1
Ligand
BDBM42890
Substrate
Meas. Tech.
Dose response biochemical High Throughput Screening assay for agonists of the steroid receptor coactivator 1 (SRC-1) recruitment by the peroxisome proliferator-activated receptor gamma (PPARgamma)
EC50
>79370±n/a nM
Citation
 PubChem, PC Dose response biochemical High Throughput Screening assay for agonists of the steroid receptor coactivator 1 (SRC-1) recruitment by the peroxisome proliferator-activated receptor gamma (PPARgamma) PubChem Bioassay (2008)[AID] 
Target
Name:
Nuclear receptor coactivator 1
Synonyms:
BHLHE74 NCOA1 NCoA-1 Protein Hin-2 Renal carcinoma antigen NY-REN-52 SRC1 nuclear receptor coactivator 1 isoform 1
Type:
PROTEIN
Mol. Mass.:
156749.34
Organism:
Homo sapiens (Human)
Description:
ChEMBL_759690
Residue:
1441
  
Inhibitor
Name:
BDBM42890
Synonyms:
(5-Cyclohexyl-4-ethyl-4H-[1,2,4]triazol-3-ylsulfanyl)-acetic acid 2-[(5-cyclohexyl-4-ethyl-1,2,4-triazol-3-yl)sulfanyl]ethanoic acid MLS000071957 cid_650635
Type:
Small organic molecule
Emp. Form.:
C12H19N3O2S
Mol. Mass.:
269.363
SMILES:
CCn1c(SCC(O)=O)nnc1C1CCCCC1
: