Target
Nuclear receptor coactivator 1
Ligand
BDBM42895
Substrate
Meas. Tech.
Dose response biochemical High Throughput Screening assay for agonists of the steroid receptor coactivator 1 (SRC-1) recruitment by the peroxisome proliferator-activated receptor gamma (PPARgamma)
EC50
>79370±n/a nM
Citation
 PubChem, PC Dose response biochemical High Throughput Screening assay for agonists of the steroid receptor coactivator 1 (SRC-1) recruitment by the peroxisome proliferator-activated receptor gamma (PPARgamma) PubChem Bioassay (2008)[AID] 
Target
Name:
Nuclear receptor coactivator 1
Synonyms:
BHLHE74 NCOA1 NCoA-1 Protein Hin-2 Renal carcinoma antigen NY-REN-52 SRC1 nuclear receptor coactivator 1 isoform 1
Type:
PROTEIN
Mol. Mass.:
156749.34
Organism:
Homo sapiens (Human)
Description:
ChEMBL_759690
Residue:
1441
  
Inhibitor
Name:
BDBM42895
Synonyms:
3-[[(1-cyclopentyltetrazol-5-yl)methyl-piperonyl-amino]methyl]-8-methyl-carbostyril 3-[[1,3-benzodioxol-5-ylmethyl-[(1-cyclopentyl-5-tetrazolyl)methyl]amino]methyl]-8-methyl-1H-quinolin-2-one 3-{[Benzo[1,3]dioxol-5-ylmethyl-(1-cyclopentyl-1H-tetrazol-5-ylmethyl)-amino]-methyl}-8-methyl-1H-quinolin-2-one SMR000003195 | cid_654098
Type:
Small organic molecule
Emp. Form.:
C26H28N6O3
Mol. Mass.:
472.5389
SMILES:
Cc1cccc2cc(CN(Cc3nnnn3C3CCCC3)Cc3ccc4OCOc4c3)c(=O)[nH]c12
: