Target
Nuclear receptor coactivator 1
Ligand
BDBM42918
Substrate
Meas. Tech.
Dose response biochemical High Throughput Screening assay for agonists of the steroid receptor coactivator 1 (SRC-1) recruitment by the peroxisome proliferator-activated receptor gamma (PPARgamma)
EC50
>79370±n/a nM
Citation
 PubChem, PC Dose response biochemical High Throughput Screening assay for agonists of the steroid receptor coactivator 1 (SRC-1) recruitment by the peroxisome proliferator-activated receptor gamma (PPARgamma) PubChem Bioassay (2008)[AID] 
Target
Name:
Nuclear receptor coactivator 1
Synonyms:
BHLHE74 NCOA1 NCoA-1 Protein Hin-2 Renal carcinoma antigen NY-REN-52 SRC1 nuclear receptor coactivator 1 isoform 1
Type:
PROTEIN
Mol. Mass.:
156749.34
Organism:
Homo sapiens (Human)
Description:
ChEMBL_759690
Residue:
1441
  
Inhibitor
Name:
BDBM42918
Synonyms:
5-[2-[2-(cyclohexanecarbonylamino)acetyl]oxyacetyl]-2,4-dimethyl-1H-pyrrole-3-carboxylic acid ethyl ester MLS000036036 cid_2997869 ethyl 5-[2-[2-(cyclohexylcarbonylamino)ethanoyloxy]ethanoyl]-2,4-dimethyl-1H-pyrrole-3-carboxylate
Type:
Small organic molecule
Emp. Form.:
C20H28N2O6
Mol. Mass.:
392.4461
SMILES:
CCOC(=O)c1c(C)[nH]c(C(=O)COC(=O)CNC(=O)C2CCCCC2)c1C
: