Target
Apoptosis regulator Bcl-2
Ligand
BDBM33040
Substrate
Meas. Tech.
Multiplexed high-throughput screen for small molecule regulators of Bcl-2 family protein interactions, specifically Bim-Bcl-2
EC50
27640±n/a nM
Citation
 PubChem, PC Multiplexed high-throughput screen for small molecule regulators of Bcl-2 family protein interactions, specifically Bim-Bcl-2 PubChem Bioassay (2008)[AID] 
Target
Name:
Apoptosis regulator Bcl-2
Synonyms:
Apoptosis regulator Bcl-2 Protein BCL-2 BCL2_HUMAN | Bcl-2 Protein
Type:
Homodimer or heterodimer
Mol. Mass.:
26269.11
Organism:
Homo sapiens (Human)
Description:
P10415
Residue:
239
  
Inhibitor
Name:
BDBM33040
Synonyms:
MLS000039339 cid_660641
Type:
Small organic molecule
Emp. Form.:
C21H19N3O4S2
Mol. Mass.:
441.523
SMILES:
COC(=O)CSc1ncnc2c1sc1nc(-c3ccco3)c3COC(C)(C)Cc3c21
: