Target
Apoptosis regulator Bcl-2
Ligand
BDBM32266
Substrate
Meas. Tech.
Multiplexed high-throughput screen for small molecule regulators of Bcl-2 family protein interactions, specifically Bim-Bcl-2
EC50
13580±n/a nM
Citation
 PubChem, PC Multiplexed high-throughput screen for small molecule regulators of Bcl-2 family protein interactions, specifically Bim-Bcl-2 PubChem Bioassay (2008)[AID] 
Target
Name:
Apoptosis regulator Bcl-2
Synonyms:
Apoptosis regulator Bcl-2 Protein BCL-2 BCL2_HUMAN | Bcl-2 Protein
Type:
Homodimer or heterodimer
Mol. Mass.:
26269.11
Organism:
Homo sapiens (Human)
Description:
P10415
Residue:
239
  
Inhibitor
Name:
BDBM32266
Synonyms:
2,3-bis(2-furyl)-N-homoveratryl-quinoxaline-6-carboxamide N-[2-(3,4-dimethoxyphenyl)ethyl]-2,3-bis(2-furanyl)-6-quinoxalinecarboxamide N-[2-(3,4-dimethoxyphenyl)ethyl]-2,3-di-2-furylquinoxaline-6-carboxamide cid_3238500
Type:
Small organic molecule
Emp. Form.:
C27H23N3O5
Mol. Mass.:
469.4886
SMILES:
COc1ccc(CCNC(=O)c2ccc3nc(-c4ccco4)c(nc3c2)-c2ccco2)cc1OC
: