Target
Apoptosis regulator Bcl-2
Ligand
BDBM33054
Substrate
Meas. Tech.
Multiplexed high-throughput screen for small molecule regulators of Bcl-2 family protein interactions, specifically Bim-Bcl-2
EC50
39580±n/a nM
Citation
 PubChem, PC Multiplexed high-throughput screen for small molecule regulators of Bcl-2 family protein interactions, specifically Bim-Bcl-2 PubChem Bioassay (2008)[AID] 
Target
Name:
Apoptosis regulator Bcl-2
Synonyms:
Apoptosis regulator Bcl-2 Protein BCL-2 BCL2_HUMAN | Bcl-2 Protein
Type:
Homodimer or heterodimer
Mol. Mass.:
26269.11
Organism:
Homo sapiens (Human)
Description:
P10415
Residue:
239
  
Inhibitor
Name:
BDBM33054
Synonyms:
1,3-diphenyl-1H-pyrazole-5-carbonitrile 2,5-diphenylpyrazole-3-carbonitrile SMR000068966 | cid_542822
Type:
Small organic molecule
Emp. Form.:
C16H11N3
Mol. Mass.:
245.2786
SMILES:
N#Cc1cc(nn1-c1ccccc1)-c1ccccc1
: