Target
Apoptosis regulator Bcl-2
Ligand
BDBM33055
Substrate
Meas. Tech.
Multiplexed high-throughput screen for small molecule regulators of Bcl-2 family protein interactions, specifically Bim-Bcl-2
EC50
36490±n/a nM
Citation
 PubChem, PC Multiplexed high-throughput screen for small molecule regulators of Bcl-2 family protein interactions, specifically Bim-Bcl-2 PubChem Bioassay (2008)[AID] 
Target
Name:
Apoptosis regulator Bcl-2
Synonyms:
Apoptosis regulator Bcl-2 Protein BCL-2 BCL2_HUMAN | Bcl-2 Protein
Type:
Homodimer or heterodimer
Mol. Mass.:
26269.11
Organism:
Homo sapiens (Human)
Description:
P10415
Residue:
239
  
Inhibitor
Name:
BDBM33055
Synonyms:
2,3-bis(2-furanyl)-N-phenyl-6-quinoxalinecarboxamide 2,3-bis(furan-2-yl)-N-phenyl-quinoxaline-6-carboxamide 2,3-di-2-furyl-N-phenyl-6-quinoxalinecarboxamide SMR000077343 | cid_2213073
Type:
Small organic molecule
Emp. Form.:
C23H15N3O3
Mol. Mass.:
381.3835
SMILES:
O=C(Nc1ccccc1)c1ccc2nc(-c3ccco3)c(nc2c1)-c1ccco1
: