Target
Apoptosis regulator Bcl-2
Ligand
BDBM43199
Substrate
Meas. Tech.
Multiplexed high-throughput screen for small molecule regulators of Bcl-2 family protein interactions, specifically Bim-Bcl-2
EC50
15790±n/a nM
Citation
 PubChem, PC Multiplexed high-throughput screen for small molecule regulators of Bcl-2 family protein interactions, specifically Bim-Bcl-2 PubChem Bioassay (2008)[AID] 
Target
Name:
Apoptosis regulator Bcl-2
Synonyms:
Apoptosis regulator Bcl-2 Protein BCL-2 BCL2_HUMAN | Bcl-2 Protein
Type:
Homodimer or heterodimer
Mol. Mass.:
26269.11
Organism:
Homo sapiens (Human)
Description:
P10415
Residue:
239
  
Inhibitor
Name:
BDBM43199
Synonyms:
2-[[(5Z)-4-allyl-5-(3-bromo-6-keto-cyclohexa-2,4-dien-1-ylidene)-1H-1,2,4-triazol-3-yl]thio]-N-(1,3-benzodioxol-5-yl)acetamide MLS000097187 N-(1,3-benzodioxol-5-yl)-2-[[(5Z)-5-(3-bromo-6-oxo-1-cyclohexa-2,4-dienylidene)-4-prop-2-enyl-1H-1,2,4-triazol-3-yl]thio]acetamide SMR000076760 | cid_5739798
Type:
Small organic molecule
Emp. Form.:
C20H17BrN4O4S
Mol. Mass.:
489.342
SMILES:
Oc1ccc(Br)cc1-c1nnc(SCC(=O)Nc2ccc3OCOc3c2)n1CC=C
: