Target
Apoptosis regulator Bcl-2
Ligand
BDBM31075
Substrate
Meas. Tech.
Multiplexed high-throughput screen for small molecule regulators of Bcl-2 family protein interactions, specifically Bim-Bcl-2
EC50
8890±n/a nM
Citation
 PubChem, PC Multiplexed high-throughput screen for small molecule regulators of Bcl-2 family protein interactions, specifically Bim-Bcl-2 PubChem Bioassay (2008)[AID] 
Target
Name:
Apoptosis regulator Bcl-2
Synonyms:
Apoptosis regulator Bcl-2 Protein BCL-2 BCL2_HUMAN | Bcl-2 Protein
Type:
Homodimer or heterodimer
Mol. Mass.:
26269.11
Organism:
Homo sapiens (Human)
Description:
P10415
Residue:
239
  
Inhibitor
Name:
BDBM31075
Synonyms:
1-[2,3-bis(2-furanyl)-6-quinoxalinyl]-3-[4-(4-morpholinyl)phenyl]urea 1-[2,3-bis(furan-2-yl)quinoxalin-6-yl]-3-(4-morpholin-4-ylphenyl)urea N-(2,3-di-2-furyl-6-quinoxalinyl)-N'-[4-(4-morpholinyl)phenyl]urea cid_2214554
Type:
Small organic molecule
Emp. Form.:
C27H23N5O4
Mol. Mass.:
481.5026
SMILES:
O=C(Nc1ccc(cc1)N1CCOCC1)Nc1ccc2nc(-c3ccco3)c(nc2c1)-c1ccco1
: