Target
Apoptosis regulator Bcl-2
Ligand
BDBM43200
Substrate
Meas. Tech.
Multiplexed high-throughput screen for small molecule regulators of Bcl-2 family protein interactions, specifically Bim-Bcl-2
EC50
10030±n/a nM
Citation
 PubChem, PC Multiplexed high-throughput screen for small molecule regulators of Bcl-2 family protein interactions, specifically Bim-Bcl-2 PubChem Bioassay (2008)[AID] 
Target
Name:
Apoptosis regulator Bcl-2
Synonyms:
Apoptosis regulator Bcl-2 Protein BCL-2 BCL2_HUMAN | Bcl-2 Protein
Type:
Homodimer or heterodimer
Mol. Mass.:
26269.11
Organism:
Homo sapiens (Human)
Description:
P10415
Residue:
239
  
Inhibitor
Name:
BDBM43200
Synonyms:
2-(3,4-dimethoxyphenyl)-N-[(4Z)-3-keto-4-(5-methyl-3H-1,3-benzoxazol-2-ylidene)cyclohexa-1,5-dien-1-yl]acetamide 2-(3,4-dimethoxyphenyl)-N-[(4Z)-4-(5-methyl-3H-1,3-benzoxazol-2-ylidene)-3-oxo-1-cyclohexa-1,5-dienyl]acetamide MLS000109439 cid_5893607
Type:
Small organic molecule
Emp. Form.:
C24H22N2O5
Mol. Mass.:
418.4419
SMILES:
COc1ccc(CC(=O)Nc2ccc(-c3nc4cc(C)ccc4o3)c(O)c2)cc1OC
: