Target
Apoptosis regulator Bcl-2
Ligand
BDBM43201
Substrate
Meas. Tech.
Multiplexed high-throughput screen for small molecule regulators of Bcl-2 family protein interactions, specifically Bim-Bcl-2
EC50
23670±n/a nM
Citation
 PubChem, PC Multiplexed high-throughput screen for small molecule regulators of Bcl-2 family protein interactions, specifically Bim-Bcl-2 PubChem Bioassay (2008)[AID] 
Target
Name:
Apoptosis regulator Bcl-2
Synonyms:
Apoptosis regulator Bcl-2 Protein BCL-2 BCL2_HUMAN | Bcl-2 Protein
Type:
Homodimer or heterodimer
Mol. Mass.:
26269.11
Organism:
Homo sapiens (Human)
Description:
P10415
Residue:
239
  
Inhibitor
Name:
BDBM43201
Synonyms:
(2Z,4S,6S,12aS)-4-(dimethylamino)-6,10,11,12a-tetrahydroxy-2-[hydroxy-(1-pyrrolidinylmethylamino)methylidene]-6-methyl-4,4a,5,5a-tetrahydrotetracene-1,3,12-trione (2Z,4S,6S,12aS)-4-(dimethylamino)-6,10,11,12a-tetrahydroxy-2-[hydroxy-(pyrrolidinomethylamino)methylene]-6-methyl-4,4a,5,5a-tetrahydrotetracene-1,3,12-trione MLS000028710 SMR000058701 | cid_6420073
Type:
Small organic molecule
Emp. Form.:
C27H33N3O8
Mol. Mass.:
527.5662
SMILES:
CN(C)[C@H]1C2CC3C(C(=O)c4c(O)cccc4[C@@]3(C)O)C(=O)[C@]2(O)C(=O)C(C(=O)NCN2CCCC2)C1=O
: