Target
Apoptosis regulator Bcl-2
Ligand
BDBM33084
Substrate
Meas. Tech.
Multiplexed high-throughput screen for small molecule regulators of Bcl-2 family protein interactions, specifically Bim-Bcl-2
EC50
1630±n/a nM
Citation
 PubChem, PC Multiplexed high-throughput screen for small molecule regulators of Bcl-2 family protein interactions, specifically Bim-Bcl-2 PubChem Bioassay (2008)[AID] 
Target
Name:
Apoptosis regulator Bcl-2
Synonyms:
Apoptosis regulator Bcl-2 Protein BCL-2 BCL2_HUMAN | Bcl-2 Protein
Type:
Homodimer or heterodimer
Mol. Mass.:
26269.11
Organism:
Homo sapiens (Human)
Description:
P10415
Residue:
239
  
Inhibitor
Name:
BDBM33084
Synonyms:
5-[4-(dimethylamino)phenyl]imino-1-(2-hydroxyethyl)-2,6-diketo-4-methyl-nicotinonitrile 5-[4-(dimethylamino)phenyl]imino-1-(2-hydroxyethyl)-4-methyl-2,6-dioxo-3-pyridinecarbonitrile MLS000519524 cid_672376
Type:
Small organic molecule
Emp. Form.:
C17H18N4O3
Mol. Mass.:
326.3498
SMILES:
CN(C)c1ccc(cc1)\N=C1/C(C)=C(C#N)C(=O)N(CCO)C1=O
: