Target
Apoptosis regulator Bcl-2
Ligand
BDBM33087
Substrate
Meas. Tech.
Multiplexed high-throughput screen for small molecule regulators of Bcl-2 family protein interactions, specifically Bim-Bcl-2
EC50
7440±n/a nM
Citation
 PubChem, PC Multiplexed high-throughput screen for small molecule regulators of Bcl-2 family protein interactions, specifically Bim-Bcl-2 PubChem Bioassay (2008)[AID] 
Target
Name:
Apoptosis regulator Bcl-2
Synonyms:
Apoptosis regulator Bcl-2 Protein BCL-2 BCL2_HUMAN | Bcl-2 Protein
Type:
Homodimer or heterodimer
Mol. Mass.:
26269.11
Organism:
Homo sapiens (Human)
Description:
P10415
Residue:
239
  
Inhibitor
Name:
BDBM33087
Synonyms:
2,3-bis(2-furanyl)-N-(phenylmethyl)-6-quinoxalinecarboxamide MLS000534716 N-benzyl-2,3-bis(furan-2-yl)quinoxaline-6-carboxamide SMR000142133 | cid_1329592
Type:
Small organic molecule
Emp. Form.:
C24H17N3O3
Mol. Mass.:
395.4101
SMILES:
O=C(NCc1ccccc1)c1ccc2nc(-c3ccco3)c(nc2c1)-c1ccco1
: