Target
Apoptosis regulator Bcl-2
Ligand
BDBM32283
Substrate
Meas. Tech.
Multiplexed high-throughput screen for small molecule regulators of Bcl-2 family protein interactions, specifically Bim-Bcl-2
EC50
1950±n/a nM
Citation
 PubChem, PC Multiplexed high-throughput screen for small molecule regulators of Bcl-2 family protein interactions, specifically Bim-Bcl-2 PubChem Bioassay (2008)[AID] 
Target
Name:
Apoptosis regulator Bcl-2
Synonyms:
Apoptosis regulator Bcl-2 Protein BCL-2 BCL2_HUMAN | Bcl-2 Protein
Type:
Homodimer or heterodimer
Mol. Mass.:
26269.11
Organism:
Homo sapiens (Human)
Description:
P10415
Residue:
239
  
Inhibitor
Name:
BDBM32283
Synonyms:
2-[[2-amino-1-(3-methoxypropyl)pyrrolo[3,2-b]quinoxaline-3-carbonyl]amino]-4,5,6,7-tetrahydrobenzothiophene-3-carboxylic acid methyl ester 2-{[2-Amino-1-(3-methoxy-propyl)-1H-pyrrolo[2,3-b]quinoxaline-3-carbonyl]-amino}-4,5,6,7-tetrahydro-b enzo[b]thiophene-3-carboxylic acid methyl ester SMR000149846 methyl 2-[[2-amino-1-(3-methoxypropyl)pyrrolo[3,2-b]quinoxaline-3-carbonyl]amino]-4,5,6,7-tetrahydro-1-benzothiophene-3-carboxylate | methyl 2-[[2-azanyl-1-(3-methoxypropyl)pyrrolo[3,2-b]quinoxalin-3-yl]carbonylamino]-4,5,6,7-tetrahydro-1-benzothiophene-3-carboxylate
Type:
Small organic molecule
Emp. Form.:
C25H27N5O4S
Mol. Mass.:
493.578
SMILES:
COCCCn1c(N)c(C(=O)Nc2sc3CCCCc3c2C(=O)OC)c2nc3ccccc3nc12
: