Target
Apoptosis regulator Bcl-2
Ligand
BDBM32289
Substrate
Meas. Tech.
Multiplexed high-throughput screen for small molecule regulators of Bcl-2 family protein interactions, specifically Bim-Bcl-2
EC50
13780±n/a nM
Citation
 PubChem, PC Multiplexed high-throughput screen for small molecule regulators of Bcl-2 family protein interactions, specifically Bim-Bcl-2 PubChem Bioassay (2008)[AID] 
Target
Name:
Apoptosis regulator Bcl-2
Synonyms:
Apoptosis regulator Bcl-2 Protein BCL-2 BCL2_HUMAN | Bcl-2 Protein
Type:
Homodimer or heterodimer
Mol. Mass.:
26269.11
Organism:
Homo sapiens (Human)
Description:
P10415
Residue:
239
  
Inhibitor
Name:
BDBM32289
Synonyms:
2-[(1-prop-2-ynyl-3-indolyl)methylidene]indene-1,3-dione 2-[(1-propargylindol-3-yl)methylene]indane-1,3-quinone MLS000574697 cid_807202
Type:
Small organic molecule
Emp. Form.:
C21H13NO2
Mol. Mass.:
311.3334
SMILES:
O=[#6]-1\[#6](=[#6]\c2cn(-[#6]C#C)c3ccccc23)-[#6](=O)-c2ccccc-12
: