Target
Apoptosis regulator Bcl-2
Ligand
BDBM33109
Substrate
Meas. Tech.
Multiplexed high-throughput screen for small molecule regulators of Bcl-2 family protein interactions, specifically Bim-Bcl-2
EC50
18070±n/a nM
Citation
 PubChem, PC Multiplexed high-throughput screen for small molecule regulators of Bcl-2 family protein interactions, specifically Bim-Bcl-2 PubChem Bioassay (2008)[AID] 
Target
Name:
Apoptosis regulator Bcl-2
Synonyms:
Apoptosis regulator Bcl-2 Protein BCL-2 BCL2_HUMAN | Bcl-2 Protein
Type:
Homodimer or heterodimer
Mol. Mass.:
26269.11
Organism:
Homo sapiens (Human)
Description:
P10415
Residue:
239
  
Inhibitor
Name:
BDBM33109
Synonyms:
4-(1H-Perimidin-2-yl)-phenylamine MLS000567502 [4-(1H-perimidin-2-yl)phenyl]amine | cid_777097
Type:
Small organic molecule
Emp. Form.:
C17H13N3
Mol. Mass.:
259.3052
SMILES:
Nc1ccc(cc1)-c1nc2cccc3cccc([nH]1)c23
: