Target
DNA-directed RNA polymerase subunit beta
Ligand
BDBM43303
Substrate
Meas. Tech.
RNA polymerase SAR
IC50
>50000±n/a nM
Citation
 PubChem, PC RNA polymerase SAR PubChem Bioassay (2008)[AID] 
Target
Name:
DNA-directed RNA polymerase subunit beta
Synonyms:
RNA polymerase beta subunit (EC 2.7.7.6)
Type:
Enzyme Catalytic Domain
Mol. Mass.:
150595.80
Organism:
Escherichia coli
Description:
A0A0E2LB94
Residue:
1342
  
Inhibitor
Name:
BDBM43303
Synonyms:
(4-aminonaphthalen-1-yl) 2,5-dimethoxybenzenesulfonate 2,5-dimethoxybenzenesulfonic acid (4-amino-1-naphthalenyl) ester PC-0596531 cid_16738587
Type:
Small organic molecule
Emp. Form.:
C18H17NO5S
Mol. Mass.:
359.396
SMILES:
COc1ccc(OC)c(c1)S(=O)(=O)Oc1ccc(N)c2ccccc12
: