Target
DNA-directed RNA polymerase subunit beta
Ligand
BDBM43328
Substrate
Meas. Tech.
RNA polymerase SAR
IC50
>50000±n/a nM
Citation
 PubChem, PC RNA polymerase SAR PubChem Bioassay (2008)[AID] 
Target
Name:
DNA-directed RNA polymerase subunit beta
Synonyms:
RNA polymerase beta subunit (EC 2.7.7.6)
Type:
Enzyme Catalytic Domain
Mol. Mass.:
150595.80
Organism:
Escherichia coli
Description:
A0A0E2LB94
Residue:
1342
  
Inhibitor
Name:
BDBM43328
Synonyms:
1-(4-hydroxy-1-naphthalenyl)-3-phenylurea 1-(4-hydroxynaphthalen-1-yl)-3-phenylurea PC-0626773 cid_16738603
Type:
Small organic molecule
Emp. Form.:
C17H14N2O2
Mol. Mass.:
278.3053
SMILES:
Oc1ccc(NC(=O)Nc2ccccc2)c2ccccc12
: