Target
DNA-directed RNA polymerase subunit beta
Ligand
BDBM43330
Substrate
Meas. Tech.
RNA polymerase SAR
IC50
>50000±n/a nM
Citation
 PubChem, PC RNA polymerase SAR PubChem Bioassay (2008)[AID] 
Target
Name:
DNA-directed RNA polymerase subunit beta
Synonyms:
RNA polymerase beta subunit (EC 2.7.7.6)
Type:
Enzyme Catalytic Domain
Mol. Mass.:
150595.80
Organism:
Escherichia coli
Description:
A0A0E2LB94
Residue:
1342
  
Inhibitor
Name:
BDBM43330
Synonyms:
1-(2,5-dimethoxyphenyl)-3-(1H-indol-5-yl)urea PCMD-CC-PAB-241 | cid_16738605
Type:
Small organic molecule
Emp. Form.:
C17H17N3O3
Mol. Mass.:
311.3352
SMILES:
COc1ccc(OC)c(NC(=O)Nc2ccc3[nH]ccc3c2)c1
: