Target
DNA-directed RNA polymerase subunit beta
Ligand
BDBM43339
Substrate
Meas. Tech.
RNA polymerase SAR
IC50
37476±n/a nM
Citation
 PubChem, PC RNA polymerase SAR PubChem Bioassay (2008)[AID] 
Target
Name:
DNA-directed RNA polymerase subunit beta
Synonyms:
RNA polymerase beta subunit (EC 2.7.7.6)
Type:
Enzyme Catalytic Domain
Mol. Mass.:
150595.80
Organism:
Escherichia coli
Description:
A0A0E2LB94
Residue:
1342
  
Inhibitor
Name:
BDBM43339
Synonyms:
4-amino-1-naphthalenol;hydrochloride 4-aminonaphthalen-1-ol;hydrochloride CHEMBL576321 PCMD-CC-PAB-253 | cid_2723858
Type:
Small organic molecule
Emp. Form.:
C10H9NO
Mol. Mass.:
159.1846
SMILES:
Nc1ccc(O)c2ccccc12
: