Target
Signal transducer and activator of transcription 1-alpha/beta
Ligand
BDBM36898
Substrate
Meas. Tech.
Dose response cell-based assay to measure STAT1 inhibition
IC50
23610±n/a nM
Citation
 PubChem, PC Dose response cell-based assay to measure STAT1 inhibition PubChem Bioassay (2008)[AID] 
Target
Name:
Signal transducer and activator of transcription 1-alpha/beta
Synonyms:
STAT1 Signal transducer and activator of transcription 1-alpha/beta Transcription factor ISGF-3 components p91/p84 | signal transducer and activator of transcription 1 isoform alpha
Type:
Cytosolic Transcription Factor
Mol. Mass.:
87327.69
Organism:
Homo sapiens (Human)
Description:
Stat1 was expressed in sf9 cells from a baculovirus encoding the recombinant proteins. Stat1 dimer binds to DNA.
Residue:
750
  
Inhibitor
Name:
BDBM36898
Synonyms:
MLS000078404 [4-(8-bromanyl-5H-pyrimido[5,4-b]indol-4-yl)piperazin-1-yl]-(furan-2-yl)methanone [4-(8-bromo-5H-pyrimido[5,4-b]indol-4-yl)-1-piperazinyl]-(2-furanyl)methanone cid_659580
Type:
Small organic molecule
Emp. Form.:
C19H16BrN5O2
Mol. Mass.:
426.267
SMILES:
Brc1ccc2[nH]c3c(ncnc3c2c1)N1CCN(CC1)C(=O)c1ccco1
: