Target
Signal transducer and activator of transcription 1-alpha/beta
Ligand
BDBM43504
Substrate
Meas. Tech.
Dose response cell-based assay to measure STAT1 inhibition
IC50
>55700±n/a nM
Citation
 PubChem, PC Dose response cell-based assay to measure STAT1 inhibition PubChem Bioassay (2008)[AID] 
Target
Name:
Signal transducer and activator of transcription 1-alpha/beta
Synonyms:
STAT1 Signal transducer and activator of transcription 1-alpha/beta Transcription factor ISGF-3 components p91/p84 | signal transducer and activator of transcription 1 isoform alpha
Type:
Cytosolic Transcription Factor
Mol. Mass.:
87327.69
Organism:
Homo sapiens (Human)
Description:
Stat1 was expressed in sf9 cells from a baculovirus encoding the recombinant proteins. Stat1 dimer binds to DNA.
Residue:
750
  
Inhibitor
Name:
BDBM43504
Synonyms:
5-amino-3-(2-methylphenyl)-1,2-oxazole-4-carbonitrile 5-amino-3-(2-methylphenyl)isoxazole-4-carbonitrile 5-azanyl-3-(2-methylphenyl)-1,2-oxazole-4-carbonitrile SMR000028206 | cid_3236239
Type:
Small organic molecule
Emp. Form.:
C11H9N3O
Mol. Mass.:
199.2087
SMILES:
Cc1ccccc1-c1noc(N)c1C#N
: