Target
Signal transducer and activator of transcription 1-alpha/beta
Ligand
BDBM37480
Substrate
Meas. Tech.
Dose response cell-based assay to measure STAT1 inhibition
IC50
14840±n/a nM
Citation
 PubChem, PC Dose response cell-based assay to measure STAT1 inhibition PubChem Bioassay (2008)[AID] 
Target
Name:
Signal transducer and activator of transcription 1-alpha/beta
Synonyms:
STAT1 Signal transducer and activator of transcription 1-alpha/beta Transcription factor ISGF-3 components p91/p84 | signal transducer and activator of transcription 1 isoform alpha
Type:
Cytosolic Transcription Factor
Mol. Mass.:
87327.69
Organism:
Homo sapiens (Human)
Description:
Stat1 was expressed in sf9 cells from a baculovirus encoding the recombinant proteins. Stat1 dimer binds to DNA.
Residue:
750
  
Inhibitor
Name:
BDBM37480
Synonyms:
5-ethyl-2-(pyrrolidine-1-carbonyl)thieno[3,2-c]quinolin-4-one 5-ethyl-2-pyrrolidin-1-ylcarbonyl-thieno[3,2-c]quinolin-4-one SMR000095093 | cid_5309331
Type:
Small organic molecule
Emp. Form.:
C18H18N2O2S
Mol. Mass.:
326.413
SMILES:
CCn1c2ccccc2c2sc(cc2c1=O)C(=O)N1CCCC1
: