Target
Signal transducer and activator of transcription 1-alpha/beta
Ligand
BDBM43515
Substrate
Meas. Tech.
Dose response cell-based assay to measure STAT1 inhibition
IC50
>55700±n/a nM
Citation
 PubChem, PC Dose response cell-based assay to measure STAT1 inhibition PubChem Bioassay (2008)[AID] 
Target
Name:
Signal transducer and activator of transcription 1-alpha/beta
Synonyms:
STAT1 Signal transducer and activator of transcription 1-alpha/beta Transcription factor ISGF-3 components p91/p84 | signal transducer and activator of transcription 1 isoform alpha
Type:
Cytosolic Transcription Factor
Mol. Mass.:
87327.69
Organism:
Homo sapiens (Human)
Description:
Stat1 was expressed in sf9 cells from a baculovirus encoding the recombinant proteins. Stat1 dimer binds to DNA.
Residue:
750
  
Inhibitor
Name:
BDBM43515
Synonyms:
5-amino-3-(3,4,5-triethoxyphenyl)-1,2-oxazole-4-carbonitrile 5-amino-3-(3,4,5-triethoxyphenyl)isoxazole-4-carbonitrile MLS000520399 cid_6618836
Type:
Small organic molecule
Emp. Form.:
C16H19N3O4
Mol. Mass.:
317.3398
SMILES:
CCOc1cc(cc(OCC)c1OCC)-c1noc(N)c1C#N
: