Target
Signal transducer and activator of transcription 1-alpha/beta
Ligand
BDBM43518
Substrate
Meas. Tech.
Dose response cell-based assay to measure STAT1 inhibition
IC50
>55700±n/a nM
Citation
 PubChem, PC Dose response cell-based assay to measure STAT1 inhibition PubChem Bioassay (2008)[AID] 
Target
Name:
Signal transducer and activator of transcription 1-alpha/beta
Synonyms:
STAT1 Signal transducer and activator of transcription 1-alpha/beta Transcription factor ISGF-3 components p91/p84 | signal transducer and activator of transcription 1 isoform alpha
Type:
Cytosolic Transcription Factor
Mol. Mass.:
87327.69
Organism:
Homo sapiens (Human)
Description:
Stat1 was expressed in sf9 cells from a baculovirus encoding the recombinant proteins. Stat1 dimer binds to DNA.
Residue:
750
  
Inhibitor
Name:
BDBM43518
Synonyms:
2-[(E)-1-(benzenesulfonyl)-2-(3-methylphenyl)ethenyl]-1H-benzimidazole 2-[(E)-2-(3-methylphenyl)-1-(phenylsulfonyl)ethenyl]-1H-benzimidazole SMR000260294 | cid_6265504
Type:
Small organic molecule
Emp. Form.:
C22H18N2O2S
Mol. Mass.:
374.456
SMILES:
Cc1cccc(\C=C(/c2nc3ccccc3[nH]2)S(=O)(=O)c2ccccc2)c1
: