Target
Signal transducer and activator of transcription 1-alpha/beta
Ligand
BDBM43519
Substrate
Meas. Tech.
Dose response cell-based assay to measure STAT1 inhibition
IC50
4239±n/a nM
Citation
 PubChem, PC Dose response cell-based assay to measure STAT1 inhibition PubChem Bioassay (2008)[AID] 
Target
Name:
Signal transducer and activator of transcription 1-alpha/beta
Synonyms:
STAT1 Signal transducer and activator of transcription 1-alpha/beta Transcription factor ISGF-3 components p91/p84 | signal transducer and activator of transcription 1 isoform alpha
Type:
Cytosolic Transcription Factor
Mol. Mass.:
87327.69
Organism:
Homo sapiens (Human)
Description:
Stat1 was expressed in sf9 cells from a baculovirus encoding the recombinant proteins. Stat1 dimer binds to DNA.
Residue:
750
  
Inhibitor
Name:
BDBM43519
Synonyms:
3-[[4-(2-fluorophenyl)-1,3-thiazol-2-yl]methyl]-2-[(4-methylpiperazin-1-yl)methyl]quinazolin-4-one 3-[[4-(2-fluorophenyl)thiazol-2-yl]methyl]-2-[(4-methylpiperazino)methyl]quinazolin-4-one SMR000264258 | cid_4302443
Type:
Small organic molecule
Emp. Form.:
C24H24FN5OS
Mol. Mass.:
449.544
SMILES:
CN1CCN(Cc2nc3ccccc3c(=O)n2Cc2nc(cs2)-c2ccccc2F)CC1
: