Target
Signal transducer and activator of transcription 1-alpha/beta
Ligand
BDBM43520
Substrate
Meas. Tech.
Dose response cell-based assay to measure STAT1 inhibition
IC50
9576±n/a nM
Citation
 PubChem, PC Dose response cell-based assay to measure STAT1 inhibition PubChem Bioassay (2008)[AID] 
Target
Name:
Signal transducer and activator of transcription 1-alpha/beta
Synonyms:
STAT1 Signal transducer and activator of transcription 1-alpha/beta Transcription factor ISGF-3 components p91/p84 | signal transducer and activator of transcription 1 isoform alpha
Type:
Cytosolic Transcription Factor
Mol. Mass.:
87327.69
Organism:
Homo sapiens (Human)
Description:
Stat1 was expressed in sf9 cells from a baculovirus encoding the recombinant proteins. Stat1 dimer binds to DNA.
Residue:
750
  
Inhibitor
Name:
BDBM43520
Synonyms:
2-[(4-methyl-1-piperazinyl)methyl]-3-[[4-(2-naphthalenyl)-2-thiazolyl]methyl]-4-quinazolinone 2-[(4-methylpiperazino)methyl]-3-[[4-(2-naphthyl)thiazol-2-yl]methyl]quinazolin-4-one MLS000390650 cid_5238107
Type:
Small organic molecule
Emp. Form.:
C28H27N5OS
Mol. Mass.:
481.612
SMILES:
CN1CCN(Cc2nc3ccccc3c(=O)n2Cc2nc(cs2)-c2ccc3ccccc3c2)CC1
: