Target
Signal transducer and activator of transcription 1-alpha/beta
Ligand
BDBM43526
Substrate
Meas. Tech.
Dose response cell-based assay to measure STAT1 inhibition
IC50
9385±n/a nM
Citation
 PubChem, PC Dose response cell-based assay to measure STAT1 inhibition PubChem Bioassay (2008)[AID] 
Target
Name:
Signal transducer and activator of transcription 1-alpha/beta
Synonyms:
STAT1 Signal transducer and activator of transcription 1-alpha/beta Transcription factor ISGF-3 components p91/p84 | signal transducer and activator of transcription 1 isoform alpha
Type:
Cytosolic Transcription Factor
Mol. Mass.:
87327.69
Organism:
Homo sapiens (Human)
Description:
Stat1 was expressed in sf9 cells from a baculovirus encoding the recombinant proteins. Stat1 dimer binds to DNA.
Residue:
750
  
Inhibitor
Name:
BDBM43526
Synonyms:
2-[2-(2,4-dihydroxyphenyl)-2-oxoethyl]sulfanyl-1H-quinazolin-4-one 2-[[2-(2,4-dihydroxyphenyl)-2-keto-ethyl]thio]-1H-quinazolin-4-one MLS000714554 cid_772018
Type:
Small organic molecule
Emp. Form.:
C16H12N2O4S
Mol. Mass.:
328.342
SMILES:
Oc1ccc(C(=O)CSc2nc3ccccc3c(=O)[nH]2)c(O)c1
: