Target
Signal transducer and activator of transcription 1-alpha/beta
Ligand
BDBM43527
Substrate
Meas. Tech.
Dose response cell-based assay to measure STAT1 inhibition
IC50
4363±n/a nM
Citation
 PubChem, PC Dose response cell-based assay to measure STAT1 inhibition PubChem Bioassay (2008)[AID] 
Target
Name:
Signal transducer and activator of transcription 1-alpha/beta
Synonyms:
STAT1 Signal transducer and activator of transcription 1-alpha/beta Transcription factor ISGF-3 components p91/p84 | signal transducer and activator of transcription 1 isoform alpha
Type:
Cytosolic Transcription Factor
Mol. Mass.:
87327.69
Organism:
Homo sapiens (Human)
Description:
Stat1 was expressed in sf9 cells from a baculovirus encoding the recombinant proteins. Stat1 dimer binds to DNA.
Residue:
750
  
Inhibitor
Name:
BDBM43527
Synonyms:
2-[(7-hydroxy-2-keto-chromen-4-yl)methylthio]-1H-quinazolin-4-one 2-[(7-hydroxy-2-oxochromen-4-yl)methylsulfanyl]-1H-quinazolin-4-one MLS000394219 cid_5686694
Type:
Small organic molecule
Emp. Form.:
C18H12N2O4S
Mol. Mass.:
352.364
SMILES:
Oc1ccc2c(CSc3nc4ccccc4c(=O)[nH]3)cc(=O)oc2c1
: