Target
Signal transducer and activator of transcription 1-alpha/beta
Ligand
BDBM43529
Substrate
Meas. Tech.
Dose response cell-based assay to measure STAT1 inhibition
IC50
3517±n/a nM
Citation
 PubChem, PC Dose response cell-based assay to measure STAT1 inhibition PubChem Bioassay (2008)[AID] 
Target
Name:
Signal transducer and activator of transcription 1-alpha/beta
Synonyms:
STAT1 Signal transducer and activator of transcription 1-alpha/beta Transcription factor ISGF-3 components p91/p84 | signal transducer and activator of transcription 1 isoform alpha
Type:
Cytosolic Transcription Factor
Mol. Mass.:
87327.69
Organism:
Homo sapiens (Human)
Description:
Stat1 was expressed in sf9 cells from a baculovirus encoding the recombinant proteins. Stat1 dimer binds to DNA.
Residue:
750
  
Inhibitor
Name:
BDBM43529
Synonyms:
2-(4-methylphenyl)-5-pyridin-4-yl-4H-benzo[i][1,3,4]benzotriazepine MLS000688074 cid_3166385
Type:
Small organic molecule
Emp. Form.:
C24H18N4
Mol. Mass.:
362.4265
SMILES:
Cc1ccc(cc1)C1=NNC(c2ccncc2)=c2ccc3ccccc3c2=N1
: