Target
Signal transducer and activator of transcription 1-alpha/beta
Ligand
BDBM43531
Substrate
Meas. Tech.
Dose response cell-based assay to measure STAT1 inhibition
IC50
17830±n/a nM
Citation
 PubChem, PC Dose response cell-based assay to measure STAT1 inhibition PubChem Bioassay (2008)[AID] 
Target
Name:
Signal transducer and activator of transcription 1-alpha/beta
Synonyms:
STAT1 Signal transducer and activator of transcription 1-alpha/beta Transcription factor ISGF-3 components p91/p84 | signal transducer and activator of transcription 1 isoform alpha
Type:
Cytosolic Transcription Factor
Mol. Mass.:
87327.69
Organism:
Homo sapiens (Human)
Description:
Stat1 was expressed in sf9 cells from a baculovirus encoding the recombinant proteins. Stat1 dimer binds to DNA.
Residue:
750
  
Inhibitor
Name:
BDBM43531
Synonyms:
4-[4-(3,4-dimethoxyphenyl)-6-(trifluoromethyl)pyrimidin-2-yl]sulfonyl-N-(5-methyl-1,2-oxazol-3-yl)butanamide 4-[[4-(3,4-dimethoxyphenyl)-6-(trifluoromethyl)-2-pyrimidinyl]sulfonyl]-N-(5-methyl-3-isoxazolyl)butanamide MLS000729577 cid_5080792
Type:
Small organic molecule
Emp. Form.:
C21H21F3N4O6S
Mol. Mass.:
514.475
SMILES:
COc1ccc(cc1OC)-c1cc(nc(n1)S(=O)(=O)CCCC(=O)Nc1cc(C)on1)C(F)(F)F
: